Target
Mast/stem cell growth factor receptor Kit
Ligand
BDBM50341234
Substrate
Meas. Tech.
ChEMBL_742006 (CHEMBL1768766)
IC50
245±n/a nM
Citation
 Leproult, EBarluenga, SMoras, DWurtz, JMWinssinger, N Cysteine mapping in conformationally distinct kinase nucleotide binding sites: application to the design of selective covalent inhibitors. J Med Chem 54:1347-55 (2011)  
Target
Name:
Mast/stem cell growth factor receptor Kit
Synonyms:
CD117 antigen KIT Mast/stem cell growth factor receptor Kit (cKIT) Proto-oncogene tyrosine-protein kinase Kit Stem cell growth factor receptor Tyrosine-protein kinase Kit c-kit v-kit Hardy-Zuckerman 4 feline sarcoma viral oncogene homolog
Type:
Protein
Mol. Mass.:
109869.37
Organism:
Homo sapiens (Human)
Description:
P10721
Residue:
976
  
Inhibitor
Name:
BDBM50341234
Synonyms:
4-(chloromethyl)-N-(4-methyl-3-(4-(pyridin-3-yl)pyrimidin-2-ylamino)phenyl)benzamide | CHEMBL1765715
Type:
Small organic molecule
Emp. Form.:
C24H20ClN5O
Mol. Mass.:
429.902
SMILES:
Cc1ccc(NC(=O)c2ccc(CCl)cc2)cc1Nc1nccc(n1)-c1cccnc1
: