Target
Platelet-derived growth factor receptor alpha
Ligand
BDBM50341234
Substrate
Meas. Tech.
ChEMBL_742007 (CHEMBL1768767)
IC50
139±n/a nM
Citation
 Leproult, EBarluenga, SMoras, DWurtz, JMWinssinger, N Cysteine mapping in conformationally distinct kinase nucleotide binding sites: application to the design of selective covalent inhibitors. J Med Chem 54:1347-55 (2011)  
Target
Name:
Platelet-derived growth factor receptor alpha
Synonyms:
Alpha-type platelet-derived growth factor receptor PDGFRA PGFRA_HUMAN Platelet-derived growth factor receptor alpha (PDGFRA) RHEPDGFRA
Type:
Protein
Mol. Mass.:
122633.38
Organism:
Homo sapiens (Human)
Description:
P16234
Residue:
1089
  
Inhibitor
Name:
BDBM50341234
Synonyms:
4-(chloromethyl)-N-(4-methyl-3-(4-(pyridin-3-yl)pyrimidin-2-ylamino)phenyl)benzamide | CHEMBL1765715
Type:
Small organic molecule
Emp. Form.:
C24H20ClN5O
Mol. Mass.:
429.902
SMILES:
Cc1ccc(NC(=O)c2ccc(CCl)cc2)cc1Nc1nccc(n1)-c1cccnc1
: