Target
3-phosphoinositide-dependent protein kinase 1
Ligand
BDBM50341250
Substrate
Meas. Tech.
ChEMBL_742335 (CHEMBL1768784)
IC50
116±n/a nM
Citation
 Medina, JRBecker, CJBlackledge, CWDuquenne, CFeng, YGrant, SWHeerding, DLi, WHMiller, WHRomeril, SPScherzer, DShu, ABobko, MAChadderton, ARDumble, MGardiner, CMGilbert, SLiu, QRabindran, SKSudakin, VXiang, HBrady, PGCampobasso, NWard, PAxten, JM Structure-based design of potent and selective 3-phosphoinositide-dependent kinase-1 (PDK1) inhibitors. J Med Chem 54:1871-95 (2011)  
Target
Name:
3-phosphoinositide-dependent protein kinase 1
Synonyms:
3-Phosphoinositide-Dependent Protein Kinase 1 (PDK1) 3-phosphoinositide-dependent protein kinase 1 3-phosphoinositide-dependent protein kinase 1 (PDK-1) Isoform 2 of 3-phosphoinositide-dependent protein kinase 1 PDPK1 Phosphoinositide-dependent protein kinase 1 (PDK1) hPDK1
Type:
Enzyme
Mol. Mass.:
63157.65
Organism:
Homo sapiens (Human)
Description:
O15530
Residue:
556
  
Inhibitor
Name:
BDBM50341250
Synonyms:
CHEMBL1765751 | N-{(3R,5R)-1-[2-Amino-6-(3-amino-1H-indazol-6-yl)-4-pyrimidinyl]-5-methyl-3-piperidinyl}-N,3,3-trimethylbutanamide
Type:
Small organic molecule
Emp. Form.:
C24H34N8O
Mol. Mass.:
450.5798
SMILES:
C[C@@H]1C[C@H](CN(C1)c1cc(nc(N)n1)-c1ccc2c(N)n[nH]c2c1)N(C)C(=O)CC(C)(C)C
: