Target
Rho-associated protein kinase 1
Ligand
BDBM50418235
Substrate
Meas. Tech.
ChEMBL_742333 (CHEMBL1768782)
IC50
<10000±n/a nM
Citation
 Medina, JRBecker, CJBlackledge, CWDuquenne, CFeng, YGrant, SWHeerding, DLi, WHMiller, WHRomeril, SPScherzer, DShu, ABobko, MAChadderton, ARDumble, MGardiner, CMGilbert, SLiu, QRabindran, SKSudakin, VXiang, HBrady, PGCampobasso, NWard, PAxten, JM Structure-based design of potent and selective 3-phosphoinositide-dependent kinase-1 (PDK1) inhibitors. J Med Chem 54:1871-95 (2011)  
Target
Name:
Rho-associated protein kinase 1
Synonyms:
ROCK-I ROCK1_HUMAN Rho-associated protein kinase Rho-associated, coiled-coil-containing protein kinase 1 Rho-kinase (ROCK I) p160 ROCK-1 | p160ROCK
Type:
Serine/threonine-protein kinase
Mol. Mass.:
158156.77
Organism:
Homo sapiens (Human)
Description:
Q13464
Residue:
1354
  
Inhibitor
Name:
BDBM50418235
Synonyms:
CHEMBL1765878
Type:
Small organic molecule
Emp. Form.:
C15H17N7
Mol. Mass.:
295.3424
SMILES:
Nc1n[nH]c2cc(ccc12)-c1cc(nc(N)n1)N1CCCC1
: