Target
Acetylcholinesterase
Ligand
BDBM50341591
Substrate
Meas. Tech.
ChEMBL_743889 (CHEMBL1767832)
IC50
44±n/a nM
Citation
 Shi, AHuang, LLu, CHe, FLi, X Synthesis, biological evaluation and molecular modeling of novel triazole-containing berberine derivatives as acetylcholinesterase and β-amyloid aggregation inhibitors. Bioorg Med Chem 19:2298-305 (2011)  
Target
Name:
Acetylcholinesterase
Synonyms:
ACES_ELEEL Acetylcholinesterase (EeAChE) | ache
Type:
Enzyme
Mol. Mass.:
71812.79
Organism:
Electrophorus electricus (Electric eel)
Description:
Residue:
633
  
Inhibitor
Name:
BDBM50341591
Synonyms:
9-O-{3-{4-[(N,N-Di-isopropyl-amino)methyl]-1H-1,2,3-triazol-1-yl}butyl}berberine bromide | CHEMBL1766122
Type:
Small organic molecule
Emp. Form.:
C31H38N5O4
Mol. Mass.:
544.664
SMILES:
COc1ccc2cc3-c4cc5OCOc5cc4CC[n+]3cc2c1OCCCCn1cc(nn1)N(C(C)C)C(C)C
: