Target
Carboxylic ester hydrolase
Ligand
BDBM50341591
Substrate
Meas. Tech.
ChEMBL_743890 (CHEMBL1767833)
IC50
6210±n/a nM
Citation
 Shi, AHuang, LLu, CHe, FLi, X Synthesis, biological evaluation and molecular modeling of novel triazole-containing berberine derivatives as acetylcholinesterase and β-amyloid aggregation inhibitors. Bioorg Med Chem 19:2298-305 (2011)  
Target
Name:
Carboxylic ester hydrolase
Synonyms:
BuChE Butyrylcholine esterase Butyrylcholinesterase (BChE) Butyrylcholinesterase (EqBuChE) butyrylcholinesterase precursor
Type:
Protein
Mol. Mass.:
68842.83
Organism:
Equus caballus (Horse)
Description:
Q9N1N9
Residue:
602
  
Inhibitor
Name:
BDBM50341591
Synonyms:
9-O-{3-{4-[(N,N-Di-isopropyl-amino)methyl]-1H-1,2,3-triazol-1-yl}butyl}berberine bromide | CHEMBL1766122
Type:
Small organic molecule
Emp. Form.:
C31H38N5O4
Mol. Mass.:
544.664
SMILES:
COc1ccc2cc3-c4cc5OCOc5cc4CC[n+]3cc2c1OCCCCn1cc(nn1)N(C(C)C)C(C)C
: