Target
DNA-dependent protein kinase catalytic subunit
Ligand
BDBM50341729
Substrate
Meas. Tech.
ChEMBL_743384 (CHEMBL1767683)
IC50
4200±n/a nM
Citation
 Charrier, JDDurrant, SJGolec, JMKay, DPKnegtel, RMMacCormick, SMortimore, MO'Donnell, MEPinder, JLReaper, PMRutherford, APWang, PSYoung, SCPollard, JR Discovery of potent and selective inhibitors of ataxia telangiectasia mutated and Rad3 related (ATR) protein kinase as potential anticancer agents. J Med Chem 54:2320-30 (2011)  
Target
Name:
DNA-dependent protein kinase catalytic subunit
Synonyms:
DNA-PK catalytic subunit DNA-dependent protein kinase (DNA-PK) DNA-dependent protein kinase catalytic subunit (DNA-PK) HYRC PRKDC | PRKDC_HUMAN
Type:
Protein
Mol. Mass.:
469114.78
Organism:
Homo sapiens (Human)
Description:
P78527
Residue:
4128
  
Inhibitor
Name:
BDBM50341729
Synonyms:
3-amino-6-(3-methoxyphenyl)-N-phenylpyrazine-2-carboxamide | CHEMBL1766775
Type:
Small organic molecule
Emp. Form.:
C18H16N4O2
Mol. Mass.:
320.3452
SMILES:
COc1cccc(c1)-c1cnc(N)c(n1)C(=O)Nc1ccccc1
: