Target
Serine-protein kinase ATM
Ligand
BDBM50098126
Substrate
Meas. Tech.
ChEMBL_743383 (CHEMBL1767682)
IC50
>100000±n/a nM
Citation
 Charrier, JDDurrant, SJGolec, JMKay, DPKnegtel, RMMacCormick, SMortimore, MO'Donnell, MEPinder, JLReaper, PMRutherford, APWang, PSYoung, SCPollard, JR Discovery of potent and selective inhibitors of ataxia telangiectasia mutated and Rad3 related (ATR) protein kinase as potential anticancer agents. J Med Chem 54:2320-30 (2011)  
Target
Name:
Serine-protein kinase ATM
Synonyms:
A-T mutated ATM_HUMAN | Ataxia telangiectasia mutated
Type:
Protein
Mol. Mass.:
350696.72
Organism:
Homo sapiens (Human)
Description:
Q13315
Residue:
3056
  
Inhibitor
Name:
BDBM50098126
Synonyms:
2-(morpholin-4-yl)-benzo[h]chromen-4-one 2-morpholino-4H-benzo[h]chromen-4-one LY-293646
Type:
Small organic molecule
Emp. Form.:
C17H15NO3
Mol. Mass.:
281.3059
SMILES:
O=c1cc(oc2c3ccccc3ccc12)N1CCOCC1
: