Target
Serine/threonine-protein kinase ATR
Ligand
BDBM50341729
Substrate
Meas. Tech.
ChEMBL_743338 (CHEMBL1767585)
IC50
2200±n/a nM
Citation
 Charrier, JDDurrant, SJGolec, JMKay, DPKnegtel, RMMacCormick, SMortimore, MO'Donnell, MEPinder, JLReaper, PMRutherford, APWang, PSYoung, SCPollard, JR Discovery of potent and selective inhibitors of ataxia telangiectasia mutated and Rad3 related (ATR) protein kinase as potential anticancer agents. J Med Chem 54:2320-30 (2011)  
Target
Name:
Serine/threonine-protein kinase ATR
Synonyms:
ATR Ataxia telangiectasia and Rad3-related protein (ATR) FRP1 | Serine-protein kinase ATR
Type:
Protein
Mol. Mass.:
301404.58
Organism:
Homo sapiens (Human)
Description:
Q13535
Residue:
2644
  
Inhibitor
Name:
BDBM50341729
Synonyms:
3-amino-6-(3-methoxyphenyl)-N-phenylpyrazine-2-carboxamide | CHEMBL1766775
Type:
Small organic molecule
Emp. Form.:
C18H16N4O2
Mol. Mass.:
320.3452
SMILES:
COc1cccc(c1)-c1cnc(N)c(n1)C(=O)Nc1ccccc1
: