Target
Serine-protein kinase ATM
Ligand
BDBM50341729
Substrate
Meas. Tech.
ChEMBL_743383 (CHEMBL1767682)
IC50
>8000±n/a nM
Citation
 Charrier, JDDurrant, SJGolec, JMKay, DPKnegtel, RMMacCormick, SMortimore, MO'Donnell, MEPinder, JLReaper, PMRutherford, APWang, PSYoung, SCPollard, JR Discovery of potent and selective inhibitors of ataxia telangiectasia mutated and Rad3 related (ATR) protein kinase as potential anticancer agents. J Med Chem 54:2320-30 (2011)  
Target
Name:
Serine-protein kinase ATM
Synonyms:
A-T mutated ATM_HUMAN | Ataxia telangiectasia mutated
Type:
Protein
Mol. Mass.:
350696.72
Organism:
Homo sapiens (Human)
Description:
Q13315
Residue:
3056
  
Inhibitor
Name:
BDBM50341729
Synonyms:
3-amino-6-(3-methoxyphenyl)-N-phenylpyrazine-2-carboxamide | CHEMBL1766775
Type:
Small organic molecule
Emp. Form.:
C18H16N4O2
Mol. Mass.:
320.3452
SMILES:
COc1cccc(c1)-c1cnc(N)c(n1)C(=O)Nc1ccccc1
: