Target
Neurotensin receptor type 1
Ligand
BDBM50342239
Substrate
Meas. Tech.
ChEMBL_743646 (CHEMBL1768189)
Ki
0.240000±n/a nM
Citation
 Einsiedel, JHeld, CHervet, MPlomer, MTschammer, NHübner, HGmeiner, P Discovery of highly potent and neurotensin receptor 2 selective neurotensin mimetics. J Med Chem 54:2915-23 (2011)  
Target
Name:
Neurotensin receptor type 1
Synonyms:
Dopamine receptor D2L/neurotensin receptor NTS1 NTRR Neurotensin receptor 1 | neurotensin receptor type 1
Type:
PROTEIN
Mol. Mass.:
46278.89
Organism:
Homo sapiens (Human)
Description:
ChEMBL_1453811
Residue:
418
  
Inhibitor
Name:
BDBM50342239
Synonyms:
(S)-2-((2S,3S)-2-((S)-2-((S)-1-((S)-2-((S)-2-amino-5-guanidinopentanamido)-5-guanidinopentanoyl)pyrrolidine-2-carboxamido)-3-(4-hydroxycyclohexa-1,3-dienyl)propanamido)-3-methylpentanamido)-4-methylpentanoic acid | CHEMBL1766928
Type:
Small organic molecule
Emp. Form.:
C38H66N12O8
Mol. Mass.:
819.0062
SMILES:
[#6]-[#6]-[#6@H](-[#6])-[#6@H](-[#7]-[#6](=O)-[#6@H](-[#6]-[#6]-1=[#6]-[#6]-[#6](=O)-[#6]-[#6]-1)-[#7]-[#6](=O)-[#6@@H]-1-[#6]-[#6]-[#6]-[#7]-1-[#6](=O)-[#6@H](-[#6]-[#6]-[#6]\[#7]=[#6](\[#7])-[#7])-[#7]-[#6](=O)-[#6@@H](-[#7])-[#6]-[#6]-[#6]\[#7]=[#6](\[#7])-[#7])-[#6](=O)-[#7]-[#6@@H](-[#6]-[#6](-[#6])-[#6])-[#6](-[#8])=O
: