Target
Hydroxycarboxylic acid receptor 2
Ligand
BDBM50342520
Substrate
Meas. Tech.
ChEMBL_744662 (CHEMBL1772683)
EC50
214±n/a nM
Citation
 Imbriglio, JEDiRocco, DBodner, RRaghavan, SChen, WMarley, DEsser, CHolt, TGWolff, MSTaggart, AKWaters, MGTata, JRColletti, SL The discovery of high affinity agonists of GPR109a with reduced serum shift and improved ADME properties. Bioorg Med Chem Lett 21:2721-4 (2011)  
Target
Name:
Hydroxycarboxylic acid receptor 2
Synonyms:
G-protein coupled receptor 109A GPR109A HCAR2 HM74A NIACR1 Nicotinic acid receptor 1
Type:
G Protein-Coupled Receptor (GPCR)
Mol. Mass.:
41868.22
Organism:
Homo sapiens (Human)
Description:
Membranes from CHO cells expressing the recombinant human GPR109A were used in competition binding assay.
Residue:
363
  
Inhibitor
Name:
BDBM50342520
Synonyms:
(R)-2-((S)-2-amino-3-(3-(5-fluoropyridin-2-yl)-1,2,4-oxadiazol-5-yl)propanamido)-4-methylcyclohex-1-enecarboxylic acid | CHEMBL1770358
Type:
Small organic molecule
Emp. Form.:
C18H20FN5O4
Mol. Mass.:
389.3809
SMILES:
C[C@@H]1CCC(C(O)=O)=C(C1)NC(=O)[C@@H](N)Cc1nc(no1)-c1ccc(F)cn1
: