Target
Protein-glutamine gamma-glutamyltransferase 2
Ligand
BDBM50342560
Substrate
Meas. Tech.
ChEMBL_744966 (CHEMBL1771981)
Ki
10000±n/a nM
Citation
 Klöck, CJin, XChoi, KKhosla, CMadrid, PBSpencer, ARaimundo, BCBoardman, PLanza, GGriffin, JH Acylideneoxoindoles: a new class of reversible inhibitors of human transglutaminase 2. Bioorg Med Chem Lett 21:2692-6 (2011)  
Target
Name:
Protein-glutamine gamma-glutamyltransferase 2
Synonyms:
Protein-glutamine gamma-glutamyltransferase TGM2 Tissue transglutaminase Transglutaminase 2 (TGM2) Transglutaminase-2
Type:
Protein
Mol. Mass.:
77309.30
Organism:
Homo sapiens (Human)
Description:
P21980
Residue:
687
  
Inhibitor
Name:
BDBM50342560
Synonyms:
1,1'-methylenediindoline-2,3-dione | CHEMBL1770393
Type:
Small organic molecule
Emp. Form.:
C17H10N2O4
Mol. Mass.:
306.2723
SMILES:
O=C1N(CN2C(=O)C(=O)c3ccccc23)c2ccccc2C1=O
: