Target
Glucose-dependent insulinotropic receptor
Ligand
BDBM50342680
Substrate
Meas. Tech.
ChEMBL_745193 (CHEMBL1772424)
EC50
1±n/a nM
Citation
 Szewczyk, JWActon, JAdams, ADChicchi, GFreeman, SHoward, ADHuang, YLi, CMeinke, PTMosely, RMurphy, ESamuel, RSantini, CYang, MZhang, YZhao, KWood, HB Design of potent and selective GPR119 agonists for type II diabetes. Bioorg Med Chem Lett 21:2665-9 (2011)  
Target
Name:
Glucose-dependent insulinotropic receptor
Synonyms:
G-protein coupled receptor 119 (GPR119) GPR119 | Glucose-dependent insulinotropic receptor
Type:
Protein
Mol. Mass.:
36901.49
Organism:
Homo sapiens (Human)
Description:
Q8TDV5
Residue:
335
  
Inhibitor
Name:
BDBM50342680
Synonyms:
CHEMBL1771081 | tert-butyl 1'-(2-cyano-6-methylpyrimidin-4-yl)-4,4'-bipiperidine-1-carboxylate
Type:
Small organic molecule
Emp. Form.:
C21H31N5O2
Mol. Mass.:
385.5031
SMILES:
Cc1cc(nc(n1)C#N)N1CCC(CC1)C1CCN(CC1)C(=O)OC(C)(C)C
: