Target
Glucose-dependent insulinotropic receptor
Ligand
BDBM50342697
Substrate
Meas. Tech.
ChEMBL_745193 (CHEMBL1772424)
EC50
0.3±n/a nM
Citation
 Szewczyk, JWActon, JAdams, ADChicchi, GFreeman, SHoward, ADHuang, YLi, CMeinke, PTMosely, RMurphy, ESamuel, RSantini, CYang, MZhang, YZhao, KWood, HB Design of potent and selective GPR119 agonists for type II diabetes. Bioorg Med Chem Lett 21:2665-9 (2011)  
Target
Name:
Glucose-dependent insulinotropic receptor
Synonyms:
G-protein coupled receptor 119 (GPR119) GPR119 | Glucose-dependent insulinotropic receptor
Type:
Protein
Mol. Mass.:
36901.49
Organism:
Homo sapiens (Human)
Description:
Q8TDV5
Residue:
335
  
Inhibitor
Name:
BDBM50342697
Synonyms:
(+)-trans-4-(2-(2-(1-(5-chloropyrimidin-2-yl)piperidin-4-yl)cyclopropyl)ethoxy)-N-cyclopropyl-2-fluorobenzamide (rac)-cis-4-(2-(2-(1-(5-chloropyrimidin-2-yl)piperidin-4-yl)cyclopropyl)ethoxy)-N-cyclopropyl-2-fluorobenzamide | CHEMBL1771098
Type:
Small organic molecule
Emp. Form.:
C24H28ClFN4O2
Mol. Mass.:
458.956
SMILES:
Fc1cc(OCCC2CC2C2CCN(CC2)c2ncc(Cl)cn2)ccc1C(=O)NC1CC1
: