Target
Glucose-dependent insulinotropic receptor
Ligand
BDBM50342702
Substrate
Meas. Tech.
ChEMBL_745193 (CHEMBL1772424)
EC50
2±n/a nM
Citation
 Szewczyk, JWActon, JAdams, ADChicchi, GFreeman, SHoward, ADHuang, YLi, CMeinke, PTMosely, RMurphy, ESamuel, RSantini, CYang, MZhang, YZhao, KWood, HB Design of potent and selective GPR119 agonists for type II diabetes. Bioorg Med Chem Lett 21:2665-9 (2011)  
Target
Name:
Glucose-dependent insulinotropic receptor
Synonyms:
G-protein coupled receptor 119 (GPR119) GPR119 | Glucose-dependent insulinotropic receptor
Type:
Protein
Mol. Mass.:
36901.49
Organism:
Homo sapiens (Human)
Description:
Q8TDV5
Residue:
335
  
Inhibitor
Name:
BDBM50342702
Synonyms:
6-methyl-2-(2-((1S,2R)-2-(1-(5-methylpyrimidin-2-yl)piperidin-4-yl)cyclopropyl)ethoxy)pyrimidine-4-carbonitrile | CHEMBL1771103
Type:
Small organic molecule
Emp. Form.:
C21H26N6O
Mol. Mass.:
378.4707
SMILES:
Cc1cnc(nc1)N1CCC(CC1)[C@H]1C[C@H]1CCOc1nc(C)cc(n1)C#N
: