Target
Glucose-dependent insulinotropic receptor
Ligand
BDBM50342703
Substrate
Meas. Tech.
ChEMBL_745193 (CHEMBL1772424)
EC50
0.2±n/a nM
Citation
 Szewczyk, JWActon, JAdams, ADChicchi, GFreeman, SHoward, ADHuang, YLi, CMeinke, PTMosely, RMurphy, ESamuel, RSantini, CYang, MZhang, YZhao, KWood, HB Design of potent and selective GPR119 agonists for type II diabetes. Bioorg Med Chem Lett 21:2665-9 (2011)  
Target
Name:
Glucose-dependent insulinotropic receptor
Synonyms:
G-protein coupled receptor 119 (GPR119) GPR119 | Glucose-dependent insulinotropic receptor
Type:
Protein
Mol. Mass.:
36901.49
Organism:
Homo sapiens (Human)
Description:
Q8TDV5
Residue:
335
  
Inhibitor
Name:
BDBM50342703
Synonyms:
CHEMBL1771104 | rac-4-(3-(2-(3-(1-(5-chloropyrimidin-2-yl)piperidin-4-yl)propyl)cyclopropyl)propoxy)-N-cyclopropyl-2-fluorobenzamide
Type:
Small organic molecule
Emp. Form.:
C28H36ClFN4O2
Mol. Mass.:
515.062
SMILES:
Fc1cc(OCCCC2CC2CCCC2CCN(CC2)c2ncc(Cl)cn2)ccc1C(=O)NC1CC1
: