Target
D(3) dopamine receptor
Ligand
BDBM50342712
Substrate
Meas. Tech.
ChEMBL_744158 (CHEMBL1771857)
Ki
1.6±n/a nM
Citation
 Ortega, RHübner, HGmeiner, PMasaguer, CF Aromatic ring functionalization of benzolactam derivatives: new potent dopamine D3 receptor ligands. Bioorg Med Chem Lett 21:2670-4 (2011)  
Target
Name:
D(3) dopamine receptor
Synonyms:
DOPAMINE D3 DRD3_HUMAN Dopamine D3 receptor (D3) Dopamine receptor Dopamine receptor D3
Type:
Mol. Mass.:
44243.43
Organism:
Homo sapiens (Human)
Description:
Residue:
400
  
Inhibitor
Name:
BDBM50342712
Synonyms:
6-fluoro-2-(4-(4-(2-methoxyphenyl)piperazin-1-yl)butyl)-3,4-dihydroisoquinolin-1(2H)-one | CHEMBL1771106
Type:
Small organic molecule
Emp. Form.:
C24H30FN3O2
Mol. Mass.:
411.5123
SMILES:
COc1ccccc1N1CCN(CCCCN2CCc3cc(F)ccc3C2=O)CC1
: