Target
Solute carrier family 5 member 4
Ligand
BDBM50313368
Substrate
Meas. Tech.
ChEMBL_745217 (CHEMBL1772493)
IC50
6.98±n/a nM
Citation
 Mascitti, VMaurer, TSRobinson, RPBian, JBoustany-Kari, CMBrandt, TCollman, BMKalgutkar, ASKlenotic, MKLeininger, MTLowe, AMaguire, RJMasterson, VMMiao, ZMukaiyama, EPatel, JDPettersen, JCPréville, CSamas, BShe, LSobol, ZSteppan, CMStevens, BDThuma, BATugnait, MZeng, DZhu, T Discovery of a clinical candidate from the structurally unique dioxa-bicyclo[3.2.1]octane class of sodium-dependent glucose cotransporter 2 inhibitors. J Med Chem 54:2952-60 (2011)  
Target
Name:
Solute carrier family 5 member 4
Synonyms:
Low affinity sodium-glucose cotransporter SAAT1 SGLT3 Sodium/glucose cotransporter 3 | Solute carrier family 5 member 4
Type:
PROTEIN
Mol. Mass.:
72452.26
Organism:
Homo sapiens (Human)
Description:
ChEMBL_764617
Residue:
659
  
Inhibitor
Name:
BDBM50313368
Synonyms:
(6S,7R,8R,9S)-6-(3-(4-methoxybenzyl)-4-methylphenyl)-2,5-dioxaspiro[3.5]nonane-7,8,9-triol | CHEMBL1090058
Type:
Small organic molecule
Emp. Form.:
C22H26O6
Mol. Mass.:
386.4382
SMILES:
COc1ccc(Cc2cc(ccc2C)[C@@H]2OC3(COC3)[C@@H](O)[C@H](O)[C@H]2O)cc1
: