Target
P2Y purinoceptor 14
Ligand
BDBM50343131
Substrate
Meas. Tech.
ChEMBL_745158 (CHEMBL1772337)
IC50
1±n/a nM
Citation
 Guay, DBeaulieu, CBelley, MCrane, SNDeLuca, JGareau, YHamel, MHenault, MHyjazie, HKargman, SChan, CCXu, LGordon, RLi, LMamane, YMorin, NMancini, JThérien, MTranmer, GTruong, VLWang, ZBlack, WC Synthesis and SAR of pyrimidine-based, non-nucleotide P2Y14 receptor antagonists. Bioorg Med Chem Lett 21:2832-5 (2011)  
Target
Name:
P2Y purinoceptor 14
Synonyms:
G-protein coupled receptor 105 P2Y14 P2ry14 | UDP-glucose receptor
Type:
PROTEIN
Mol. Mass.:
38883.93
Organism:
Mus musculus
Description:
ChEMBL_745158
Residue:
338
  
Inhibitor
Name:
BDBM50343131
Synonyms:
2-(2-cyanopyrimidin-5-yl)-N-(3-ethylphenyl)-4-o-tolyl-7,8-dihydropyrido[4,3-d]pyrimidine-6(5H)-carboxamide | CHEMBL1771459
Type:
Small organic molecule
Emp. Form.:
C28H25N7O
Mol. Mass.:
475.5444
SMILES:
CCc1cccc(NC(=O)N2CCc3nc(nc(c3C2)-c2ccccc2C)-c2cnc(nc2)C#N)c1
: