Target
Tyrosine-protein kinase ABL1
Ligand
BDBM50343426
Substrate
Meas. Tech.
ChEMBL_745920 (CHEMBL1776290)
Ki
340±n/a nM
Citation
 Radi, MDreassi, EBrullo, CCrespan, ETintori, CBernardo, VValoti, MZamperini, CDaigl, HMusumeci, FCarraro, FNaldini, AFilippi, IMaga, GSchenone, SBotta, M Design, synthesis, biological activity, and ADME properties of pyrazolo[3,4-d]pyrimidines active in hypoxic human leukemia cells: a lead optimization study. J Med Chem 54:2610-26 (2011)  
Target
Name:
Tyrosine-protein kinase ABL1
Synonyms:
ABL ABL1_HUMAN JTK7 Proto-oncogene tyrosine-protein kinase ABL1 Tyrosine-protein kinase ABL V-abl Abelson murine leukemia viral oncogene homolog 1 p150 | tyrosine-protein kinase ABL1 isoform a
Type:
Enzyme
Mol. Mass.:
122897.30
Organism:
Homo sapiens (Human)
Description:
P00519
Residue:
1130
  
Inhibitor
Name:
BDBM50343426
Synonyms:
1-(2-Chloro-2-phenylethyl)-6-[(2-morpholin-4-ylethyl)thio]-N-propyl-1H-pyrazolo[3,4-d]pyrimidin-4-amine | CHEMBL1775040
Type:
Small organic molecule
Emp. Form.:
C22H29ClN6OS
Mol. Mass.:
461.023
SMILES:
CCCNc1nc(SCCN2CCOCC2)nc2n(CC(Cl)c3ccccc3)ncc12
: