Target
Glucose-dependent insulinotropic receptor
Ligand
BDBM50343444
Substrate
Meas. Tech.
ChEMBL_746174 (CHEMBL1775788)
EC50
0.6±n/a nM
Citation
 Semple, GRen, AFioravanti, BPereira, GCalderon, IChoi, KXiong, YShin, YJGharbaoui, TSage, CRMorgan, MXing, CChu, ZLLeonard, JNGrottick, AJAl-Shamma, HLiang, YDemarest, KTJones, RM Discovery of fused bicyclic agonists of the orphan G-protein coupled receptor GPR119 with in vivo activity in rodent models of glucose control. Bioorg Med Chem Lett 21:3134-41 (2011)  
Target
Name:
Glucose-dependent insulinotropic receptor
Synonyms:
G-protein coupled receptor 119 (GPR119) GPR119 | Glucose-dependent insulinotropic receptor
Type:
Protein
Mol. Mass.:
36901.49
Organism:
Homo sapiens (Human)
Description:
Q8TDV5
Residue:
335
  
Inhibitor
Name:
BDBM50343444
Synonyms:
CHEMBL1773292 | tert-butyl 4-(9-(2-fluoro-4-(methylsulfonyl)phenyl)-8-oxo-8,9-dihydro-7H-purin-6-yloxy)piperidine-1-carboxylate
Type:
Small organic molecule
Emp. Form.:
C22H26FN5O6S
Mol. Mass.:
507.535
SMILES:
CC(C)(C)OC(=O)N1CCC(CC1)Oc1ncnc2n(-c3ccc(cc3F)S(C)(=O)=O)c(=O)[nH]c12
: