Target
Glucose-dependent insulinotropic receptor
Ligand
BDBM50343445
Substrate
Meas. Tech.
ChEMBL_746174 (CHEMBL1775788)
EC50
0.7±n/a nM
Citation
 Semple, GRen, AFioravanti, BPereira, GCalderon, IChoi, KXiong, YShin, YJGharbaoui, TSage, CRMorgan, MXing, CChu, ZLLeonard, JNGrottick, AJAl-Shamma, HLiang, YDemarest, KTJones, RM Discovery of fused bicyclic agonists of the orphan G-protein coupled receptor GPR119 with in vivo activity in rodent models of glucose control. Bioorg Med Chem Lett 21:3134-41 (2011)  
Target
Name:
Glucose-dependent insulinotropic receptor
Synonyms:
G-protein coupled receptor 119 (GPR119) GPR119 | Glucose-dependent insulinotropic receptor
Type:
Protein
Mol. Mass.:
36901.49
Organism:
Homo sapiens (Human)
Description:
Q8TDV5
Residue:
335
  
Inhibitor
Name:
BDBM50343445
Synonyms:
CHEMBL1773293 | tert-butyl 4-(3-(4-(methylsulfonyl)phenyl)isoxazolo[4,5-d]pyrimidin-7-yloxy)piperidine-1-carboxylate
Type:
Small organic molecule
Emp. Form.:
C22H26N4O6S
Mol. Mass.:
474.53
SMILES:
CC(C)(C)OC(=O)N1CCC(CC1)Oc1ncnc2c(noc12)-c1ccc(cc1)S(C)(=O)=O
: