Target
Glucose-dependent insulinotropic receptor
Ligand
BDBM50343447
Substrate
Meas. Tech.
ChEMBL_746174 (CHEMBL1775788)
EC50
1.1±n/a nM
Citation
 Semple, GRen, AFioravanti, BPereira, GCalderon, IChoi, KXiong, YShin, YJGharbaoui, TSage, CRMorgan, MXing, CChu, ZLLeonard, JNGrottick, AJAl-Shamma, HLiang, YDemarest, KTJones, RM Discovery of fused bicyclic agonists of the orphan G-protein coupled receptor GPR119 with in vivo activity in rodent models of glucose control. Bioorg Med Chem Lett 21:3134-41 (2011)  
Target
Name:
Glucose-dependent insulinotropic receptor
Synonyms:
G-protein coupled receptor 119 (GPR119) GPR119 | Glucose-dependent insulinotropic receptor
Type:
Protein
Mol. Mass.:
36901.49
Organism:
Homo sapiens (Human)
Description:
Q8TDV5
Residue:
335
  
Inhibitor
Name:
BDBM50343447
Synonyms:
CHEMBL1775169 | tert-butyl 4-(1-(4-(methylsulfonyl)phenyl)-1H-pyrazolo[3,4-d]pyrimidin-4-yloxy)piperidine-1-carboxylate
Type:
Small organic molecule
Emp. Form.:
C22H27N5O5S
Mol. Mass.:
473.545
SMILES:
CC(C)(C)OC(=O)N1CCC(CC1)Oc1ncnc2n(ncc12)-c1ccc(cc1)S(C)(=O)=O
: