Target
Neuropeptide Y receptor type 1
Ligand
BDBM50343734
Substrate
Meas. Tech.
ChEMBL_747562 (CHEMBL1777096)
Ki
38±n/a nM
Citation
 Keller, MErdmann, DPop, NPluym, NTeng, SBernhardt, GBuschauer, A Red-fluorescent argininamide-type NPY Y1 receptor antagonists as pharmacological tools. Bioorg Med Chem 19:2859-78 (2011)  
Target
Name:
Neuropeptide Y receptor type 1
Synonyms:
NPY-Y1 NPY1R NPYR neuropeptide Y receptor Y1
Type:
Enzyme Catalytic Domain
Mol. Mass.:
44399.07
Organism:
Homo sapiens (Human)
Description:
NPY-Y1 NPY1R HUMAN::P25929
Residue:
384
  
Inhibitor
Name:
BDBM50343734
Synonyms:
(R)-5-(3-(4-aminobutyl)-1-carbamimidoylureido)-2-(2,2-diphenylacetamido)-N-(4-hydroxybenzyl)pentanamide | CHEMBL1774207
Type:
Small organic molecule
Emp. Form.:
C32H41N7O4
Mol. Mass.:
587.7124
SMILES:
NCCCCNC(=O)N(CCC[C@@H](NC(=O)C(c1ccccc1)c1ccccc1)C(=O)NCc1ccc(O)cc1)C(N)=N
: