Target
Neuropeptide Y receptor type 1
Ligand
BDBM50343744
Substrate
Meas. Tech.
ChEMBL_747562 (CHEMBL1777096)
Ki
130±n/a nM
Citation
 Keller, MErdmann, DPop, NPluym, NTeng, SBernhardt, GBuschauer, A Red-fluorescent argininamide-type NPY Y1 receptor antagonists as pharmacological tools. Bioorg Med Chem 19:2859-78 (2011)  
Target
Name:
Neuropeptide Y receptor type 1
Synonyms:
NPY-Y1 NPY1R NPYR neuropeptide Y receptor Y1
Type:
Enzyme Catalytic Domain
Mol. Mass.:
44399.07
Organism:
Homo sapiens (Human)
Description:
NPY-Y1 NPY1R HUMAN::P25929
Residue:
384
  
Inhibitor
Name:
BDBM50343744
Synonyms:
1-((R)-9-Amino-4-(2,2-diphenylacetamido)-1-(4-hydroxyphenyl)-3,11,16-trioxo-20,23-dioxa-2,8,10,17-tetraazapentacos-9-en-25-yl)-2,6-dimethyl-4-(3-(1,1,3-trimethyl-1H-benzo[e]indol-2(3H)-ylidene)prop-1-enyl)pyridinium hydrotrifluoroacetate | CHEMBL1774220
Type:
Small organic molecule
Emp. Form.:
C64H77N8O7
Mol. Mass.:
1070.345
SMILES:
CN1\C(=C/C=Cc2cc(C)[n+](CCOCCOCCNC(=O)CCCCC(=O)NC(N)=NCCC[C@@H](NC(=O)C(c3ccccc3)c3ccccc3)C(=O)NCc3ccc(O)cc3)c(C)c2)C(C)(C)c2c1ccc1ccccc21
: