Target
Neuropeptide Y receptor type 1
Ligand
BDBM50343728
Substrate
Meas. Tech.
ChEMBL_747574 (CHEMBL1777155)
Kd
5±n/a nM
Citation
 Keller, MErdmann, DPop, NPluym, NTeng, SBernhardt, GBuschauer, A Red-fluorescent argininamide-type NPY Y1 receptor antagonists as pharmacological tools. Bioorg Med Chem 19:2859-78 (2011)  
Target
Name:
Neuropeptide Y receptor type 1
Synonyms:
NPY-Y1 NPY1R NPYR neuropeptide Y receptor Y1
Type:
Enzyme Catalytic Domain
Mol. Mass.:
44399.07
Organism:
Homo sapiens (Human)
Description:
NPY-Y1 NPY1R HUMAN::P25929
Residue:
384
  
Inhibitor
Name:
BDBM50343728
Synonyms:
3-((R)-9-Amino-4-(2,2-diphenylacetamido)-1-(4-hydroxyphenyl)-3,11,18-trioxo-2,8,10,12,17-pentaazahenicos-9-en-21-yl)-2-((1E,3E)-4-(4-(dimethylamino)phenyl)buta-1,3-enyl)benzo[d]thiazol-3-ium hydrotrifluoroacetate | CHEMBL1774344
Type:
Small organic molecule
Emp. Form.:
C55H64N9O5S
Mol. Mass.:
963.218
SMILES:
CN(C)c1ccc(C=CC=Cc2sc3ccccc3[n+]2CCCC(=O)NCCCCNC(=O)NC(N)=NCCC[C@@H](NC(=O)C(c2ccccc2)c2ccccc2)C(=O)NCc2ccc(O)cc2)cc1
: