Target
Muscarinic acetylcholine receptor M3
Ligand
BDBM50344294
Substrate
Meas. Tech.
ChEMBL_748300 (CHEMBL1781310)
IC50
0.2±n/a nM
Citation
 Prat, MBuil, MAFernández, MDCastro, JMonleón, JMTort, LCasals, GFerrer, MHuerta, JMEspinosa, SLópez, MSegarra, VGavaldà, AMiralpeix, MRamos, IVilella, DGonzález, MCórdoba, MCárdenas, AAntón, FBeleta, JRyder, H Discovery of novel quaternary ammonium derivatives of (3R)-quinuclidinyl carbamates as potent and long acting muscarinic antagonists. Bioorg Med Chem Lett 21:3457-61 (2011)  
Target
Name:
Muscarinic acetylcholine receptor M3
Synonyms:
ACM3_HUMAN Cholinergic, muscarinic M3 Muscarinic receptor M3 | RecName: Full=Muscarinic acetylcholine receptor M3
Type:
Enzyme
Mol. Mass.:
66151.03
Organism:
Homo sapiens (Human)
Description:
P20309
Residue:
590
  
Inhibitor
Name:
BDBM50344294
Synonyms:
(R)-1-(2-phenoxyethyl)-3-(phenyl(thiophen-3-ylmethyl)carbamoyloxy)-1-azoniabicyclo[2.2.2]octane bromide | CHEMBL1779133
Type:
Small organic molecule
Emp. Form.:
C27H31N2O3S
Mol. Mass.:
463.611
SMILES:
O=C(O[C@H]1C[N+]2(CCOc3ccccc3)CCC1CC2)N(Cc1ccsc1)c1ccccc1
: