Target
Sodium/glucose cotransporter 2
Ligand
BDBM50344676
Substrate
Meas. Tech.
ChEMBL_749005 (CHEMBL1781790)
IC50
7±n/a nM
Citation
 Du, XLizarzaburu, MTurcotte, SLee, TGreenberg, JShan, BFan, PLing, YMedina, JCHouze, J Optimization of triazoles as novel and potent nonphlorizin SGLT2 inhibitors. Bioorg Med Chem Lett 21:3774-9 (2011)  
Target
Name:
Sodium/glucose cotransporter 2
Synonyms:
Na(+)/glucose cotransporter 2 SGLT2 Sodium-Dependent Glucose Cotransporter 2 (SGLT2) Solute carrier family 5 member 2
Type:
Protein
Mol. Mass.:
72902.00
Organism:
Homo sapiens (Human)
Description:
P31639
Residue:
672
  
Inhibitor
Name:
BDBM50344676
Synonyms:
6-chloro-8-nitro-4-((5-(5-(trifluoromethyl)pyridin-2-yl)-4-(3,3,3-trifluoropropyl)-4H-1,2,4-triazol-3-yl)methyl)-2H-benzo[b][1,4]oxazin-3(4H)-one | CHEMBL1779336
Type:
Small organic molecule
Emp. Form.:
C20H13ClF6N6O4
Mol. Mass.:
550.798
SMILES:
[O-][N+](=O)c1cc(Cl)cc2N(Cc3nnc(-c4ccc(cn4)C(F)(F)F)n3CCC(F)(F)F)C(=O)COc12
: