Target
Sodium/glucose cotransporter 2
Ligand
BDBM50344680
Substrate
Meas. Tech.
ChEMBL_749005 (CHEMBL1781790)
IC50
3±n/a nM
Citation
 Du, XLizarzaburu, MTurcotte, SLee, TGreenberg, JShan, BFan, PLing, YMedina, JCHouze, J Optimization of triazoles as novel and potent nonphlorizin SGLT2 inhibitors. Bioorg Med Chem Lett 21:3774-9 (2011)  
Target
Name:
Sodium/glucose cotransporter 2
Synonyms:
Na(+)/glucose cotransporter 2 SGLT2 Sodium-Dependent Glucose Cotransporter 2 (SGLT2) Solute carrier family 5 member 2
Type:
Protein
Mol. Mass.:
72902.00
Organism:
Homo sapiens (Human)
Description:
P31639
Residue:
672
  
Inhibitor
Name:
BDBM50344680
Synonyms:
4-((5-(5-chloropyridin-2-yl)-4-propyl-4H-1,2,4-triazol-3-yl)methyl)-6,8-dimethyl-2H-benzo[b][1,4]oxazin-3(4H)-one | CHEMBL1779340
Type:
Small organic molecule
Emp. Form.:
C21H22ClN5O2
Mol. Mass.:
411.885
SMILES:
CCCn1c(CN2C(=O)COc3c(C)cc(C)cc23)nnc1-c1ccc(Cl)cn1
: