Target
MAP kinase-activated protein kinase 2
Ligand
BDBM50344724
Substrate
Meas. Tech.
ChEMBL_749048 (CHEMBL1780645)
EC50
6.3±n/a nM
Citation
 Kaptein, AOubrie, Ade Zwart, EHoogenboom, Nde Wit, Jvan de Kar, Bvan Hoek, MVogel, Gde Kimpe, VSchultz-Fademrecht, CBorsboom, Jvan Zeeland, MVersteegh, JKazemier, Bde Roos, JWijnands, FDulos, JJaeger, MLeandro-Garcia, PBarf, T Discovery of selective and orally available spiro-3-piperidyl ATP-competitive MK2 inhibitors. Bioorg Med Chem Lett 21:3823-7 (2011)  
Target
Name:
MAP kinase-activated protein kinase 2
Synonyms:
MAP kinase-activated protein kinase 2 (MAPKAPK2) MAP kinase-activated protein kinase 2 (p38/MK2) MAPK-activated protein kinase 2 MAPKAP kinase 2 MAPKAPK2 | MK2
Type:
Serine/threonine-protein kinase
Mol. Mass.:
45579.87
Organism:
Homo sapiens (Human)
Description:
P49137
Residue:
400
  
Inhibitor
Name:
BDBM50344724
Synonyms:
2'-(2-(quinolin-3-yl)pyrimidin-4-yl)-5',6'-dihydrospiro[piperidine-4,7'-pyrrolo[3,2-c]pyridin]-4'(1'H)-one | CHEMBL1779361
Type:
Small organic molecule
Emp. Form.:
C24H22N6O
Mol. Mass.:
410.4711
SMILES:
O=C1NCC2(CCNCC2)c2[nH]c(cc12)-c1ccnc(n1)-c1cnc2ccccc2c1
: