Target
Prostaglandin D2 receptor 2
Ligand
BDBM50026419
Substrate
Meas. Tech.
ChEMBL_749090 (CHEMBL1780687)
IC50
<0.400000±n/a nM
Citation
 Luker, TBonnert, RSchmidt, JSargent, CPaine, SWThom, SPairaudeau, GPatel, AMohammed, RAkam, EDougall, IDavis, AMAbbott, PBrough, SMillichip, IMcInally, T Switching between agonists and antagonists at CRTh2 in a series of highly potent and selective biaryl phenoxyacetic acids. Bioorg Med Chem Lett 21:3616-21 (2011)  
Target
Name:
Prostaglandin D2 receptor 2
Synonyms:
CD_antigen=CD294 Chemoattractant Receptor-homologous molecule expressed on T-helper type 2 cells (CRTH2) Chemoattractant receptor-homologous molecule expressed on Th2 cells (CRTH2) G protein-coupled receptor 44 GPR44 PTGDR2 Prostaglandin D2 receptor 2 | Prostaglandin D2 receptor 2 (PGD2)
Type:
Enzyme
Mol. Mass.:
43295.45
Organism:
Homo sapiens (Human)
Description:
Q9Y5Y4
Residue:
395
  
Inhibitor
Name:
BDBM50026419
Synonyms:
CHEMBL1778628
Type:
Small organic molecule
Emp. Form.:
C16H10F3NO3
Mol. Mass.:
321.2507
SMILES:
OC(=O)COc1ccc(cc1-c1cccc(c1)C#N)C(F)(F)F
: