Target
Prostaglandin D2 receptor 2
Ligand
BDBM50344998
Substrate
Meas. Tech.
ChEMBL_749090 (CHEMBL1780687)
IC50
0.400000±n/a nM
Citation
 Luker, TBonnert, RSchmidt, JSargent, CPaine, SWThom, SPairaudeau, GPatel, AMohammed, RAkam, EDougall, IDavis, AMAbbott, PBrough, SMillichip, IMcInally, T Switching between agonists and antagonists at CRTh2 in a series of highly potent and selective biaryl phenoxyacetic acids. Bioorg Med Chem Lett 21:3616-21 (2011)  
Target
Name:
Prostaglandin D2 receptor 2
Synonyms:
CD_antigen=CD294 Chemoattractant Receptor-homologous molecule expressed on T-helper type 2 cells (CRTH2) Chemoattractant receptor-homologous molecule expressed on Th2 cells (CRTH2) G protein-coupled receptor 44 GPR44 PTGDR2 Prostaglandin D2 receptor 2 | Prostaglandin D2 receptor 2 (PGD2)
Type:
Enzyme
Mol. Mass.:
43295.45
Organism:
Homo sapiens (Human)
Description:
Q9Y5Y4
Residue:
395
  
Inhibitor
Name:
BDBM50344998
Synonyms:
2-(2'-methyl-4'-(N-methylmethylsulfonamido)-5-(trifluoromethyl)biphenyl-2-yloxy)acetic acid | CHEMBL1778633
Type:
Small organic molecule
Emp. Form.:
C18H18F3NO5S
Mol. Mass.:
417.399
SMILES:
CN(c1ccc(c(C)c1)-c1cc(ccc1OCC(O)=O)C(F)(F)F)S(C)(=O)=O
: