Target
Solute carrier family 5 member 4
Ligand
BDBM50345019
Substrate
Meas. Tech.
ChEMBL_749157 (CHEMBL1780754)
IC50
59.5±n/a nM
Citation
 Kang, SYKim, MJLee, JSLee, J Glucosides with cyclic diarylpolynoid as novel C-aryl glucoside SGLT2 inhibitors. Bioorg Med Chem Lett 21:3759-63 (2011)  
Target
Name:
Solute carrier family 5 member 4
Synonyms:
Low affinity sodium-glucose cotransporter SAAT1 SGLT3 Sodium/glucose cotransporter 3 | Solute carrier family 5 member 4
Type:
PROTEIN
Mol. Mass.:
72452.26
Organism:
Homo sapiens (Human)
Description:
ChEMBL_764617
Residue:
659
  
Inhibitor
Name:
BDBM50345019
Synonyms:
(2R,3S,4R,5R,6S)-2-(hydroxymethyl)-6-(3-(4-(pent-2-enyloxy)benzyl)phenyl)tetrahydro-2H-pyran-3,4,5-triol | CHEMBL1778657
Type:
Small organic molecule
Emp. Form.:
C24H30O6
Mol. Mass.:
414.4914
SMILES:
CC\C=C\COc1ccc(Cc2cccc(c2)[C@@H]2O[C@H](CO)[C@@H](O)[C@H](O)[C@H]2O)cc1
: