Target
Estrogen receptor
Ligand
BDBM50345338
Substrate
Meas. Tech.
ChEMBL_752205 (CHEMBL1786581)
IC50
80000±n/a nM
Citation
 Hegazy, MEEl-Hamd H Mohamed, AEl-Halawany, AMDjemgou, PCShahat, AAParé, PW Estrogenic activity of chemical constituents from Tephrosia candida. J Nat Prod 74:937-42 (2011)  
Target
Name:
Estrogen receptor
Synonyms:
ER ESR ESR1_HUMAN Estrogen receptor Estrogen receptor (ER-alpha) Estrogen receptor alpha (ER) Nuclear receptor subfamily 3 group A member 1
Type:
Protein
Mol. Mass.:
66230.44
Organism:
Homo sapiens (Human)
Description:
P03372
Residue:
595
  
Inhibitor
Name:
BDBM50345338
Synonyms:
(E)-1-(2,4-dihydroxy-3-((Z)-3-hydroxy-3-methylbut-1-enyl)-6-methoxyphenyl)-3-(4-hydroxyphenyl)prop-2-en-1-one | CHEMBL1784260
Type:
Small organic molecule
Emp. Form.:
C21H22O6
Mol. Mass.:
370.3958
SMILES:
COc1cc(O)c(\C=C/C(C)(C)O)c(O)c1C(=O)\C=C\c1ccc(O)cc1
: