Target
5-hydroxytryptamine receptor 6
Ligand
BDBM50345751
Substrate
Meas. Tech.
ChEMBL_750637 (CHEMBL1785483)
Ki
>1000±n/a nM
Citation
 Nirogi, RVKothmirkar, PKambhampati, RKonda, JBArepalli, SPamuleti, NGDeshpande, ADBandyala, TShinde, AKDubey, PK Novel and Potent 5-Piperazinyl Methyl-N 1-aryl Sulfonyl Indole Derivatives as 5-HT6 Receptor Ligands. ACS Med Chem Lett 1:340-344 (2010)  
Target
Name:
5-hydroxytryptamine receptor 6
Synonyms:
5-HT-6 5-hydroxytryptamine receptor 6 (5-HT-6) 5-hydroxytryptamine receptor 6 (5HT6) HTR6 Serotonin 6 (5-HT6) receptor | Serotonin Receptor 6
Type:
G Protein-Coupled Receptor (GPCR)
Mol. Mass.:
46968.43
Organism:
Homo sapiens (Human)
Description:
P50406
Residue:
440
  
Inhibitor
Name:
BDBM50345751
Synonyms:
1-benzyl-5-(4-ethylpiperazin-1-yl-methyl)-1H-indole | CHEMBL1784914
Type:
Small organic molecule
Emp. Form.:
C22H27N3
Mol. Mass.:
333.4699
SMILES:
CCN1CCN(Cc2ccc3n(Cc4ccccc4)ccc3c2)CC1
: