Target
Muscarinic acetylcholine receptor M1
Ligand
BDBM50345777
Substrate
Meas. Tech.
ChEMBL_750730 (CHEMBL1785849)
IC50
1425±n/a nM
Citation
 Nirogi, RVKothmirkar, PKambhampati, RKonda, JBArepalli, SPamuleti, NGDeshpande, ADBandyala, TShinde, AKDubey, PK Novel and Potent 5-Piperazinyl Methyl-N 1-aryl Sulfonyl Indole Derivatives as 5-HT6 Receptor Ligands. ACS Med Chem Lett 1:340-344 (2010)  
Target
Name:
Muscarinic acetylcholine receptor M1
Synonyms:
ACM1_HUMAN Cholinergic receptor, muscarinic 1 | Cholinergic, muscarinic M1
Type:
Protein
Mol. Mass.:
51442.54
Organism:
Homo sapiens (Human)
Description:
P11229
Residue:
460
  
Inhibitor
Name:
BDBM50345777
Synonyms:
1-(2-Bromo benzenesulfonyl)-5-(4-ethylpiperazin-1-yl-methyl)-1H-indole | CHEMBL1784916
Type:
Small organic molecule
Emp. Form.:
C21H24BrN3O2S
Mol. Mass.:
462.403
SMILES:
CCN1CCN(Cc2ccc3n(ccc3c2)S(=O)(=O)c2ccccc2Br)CC1
: