Target
5-hydroxytryptamine receptor 7
Ligand
BDBM50345754
Substrate
Meas. Tech.
ChEMBL_750729 (CHEMBL1785848)
IC50
>10000±n/a nM
Citation
 Nirogi, RVKothmirkar, PKambhampati, RKonda, JBArepalli, SPamuleti, NGDeshpande, ADBandyala, TShinde, AKDubey, PK Novel and Potent 5-Piperazinyl Methyl-N 1-aryl Sulfonyl Indole Derivatives as 5-HT6 Receptor Ligands. ACS Med Chem Lett 1:340-344 (2010)  
Target
Name:
5-hydroxytryptamine receptor 7
Synonyms:
5-HT-7 5-HT7 5-HT7S 5HT7 HTR7 | Serotonin receptor 7
Type:
G Protein-Coupled Receptor (GPCR)
Mol. Mass.:
53573.08
Organism:
Homo sapiens (Human)
Description:
P34969
Residue:
479
  
Inhibitor
Name:
BDBM50345754
Synonyms:
3-chloro-1-(4-fluoro benzenesulfonyl)-5-(4-methylpiperazin-1-yl-methyl)-1H-indole | CHEMBL1785074
Type:
Small organic molecule
Emp. Form.:
C20H21ClFN3O2S
Mol. Mass.:
421.916
SMILES:
CN1CCN(Cc2ccc3n(cc(Cl)c3c2)S(=O)(=O)c2ccc(F)cc2)CC1
: