Target
5-hydroxytryptamine receptor 7
Ligand
BDBM50345777
Substrate
Meas. Tech.
ChEMBL_750729 (CHEMBL1785848)
IC50
>10000±n/a nM
Citation
 Nirogi, RVKothmirkar, PKambhampati, RKonda, JBArepalli, SPamuleti, NGDeshpande, ADBandyala, TShinde, AKDubey, PK Novel and Potent 5-Piperazinyl Methyl-N 1-aryl Sulfonyl Indole Derivatives as 5-HT6 Receptor Ligands. ACS Med Chem Lett 1:340-344 (2010)  
Target
Name:
5-hydroxytryptamine receptor 7
Synonyms:
5-HT-7 5-HT7 5-HT7S 5HT7 HTR7 | Serotonin receptor 7
Type:
G Protein-Coupled Receptor (GPCR)
Mol. Mass.:
53573.08
Organism:
Homo sapiens (Human)
Description:
P34969
Residue:
479
  
Inhibitor
Name:
BDBM50345777
Synonyms:
1-(2-Bromo benzenesulfonyl)-5-(4-ethylpiperazin-1-yl-methyl)-1H-indole | CHEMBL1784916
Type:
Small organic molecule
Emp. Form.:
C21H24BrN3O2S
Mol. Mass.:
462.403
SMILES:
CCN1CCN(Cc2ccc3n(ccc3c2)S(=O)(=O)c2ccccc2Br)CC1
: