Target
Amine oxidase [flavin-containing] B
Ligand
BDBM50345899
Substrate
Meas. Tech.
ChEMBL_749510 (CHEMBL1786968)
IC50
160.64±n/a nM
Citation
 Matos, MJViña, DQuezada, EPicciau, CDelogu, GOrallo, FSantana, LUriarte, E A new series of 3-phenylcoumarins as potent and selective MAO-B inhibitors. Bioorg Med Chem Lett 19:3268-70 (2009)  
Target
Name:
Amine oxidase [flavin-containing] B
Synonyms:
AOFB_HUMAN MAOB Monoamine oxidase type B (MAO B) Monoamine oxidase type B (MAOB)
Type:
Protein
Mol. Mass.:
58768.76
Organism:
Homo sapiens (Human)
Description:
P27338
Residue:
520
  
Inhibitor
Name:
BDBM50345899
Synonyms:
6-methyl-3-(3',4',5'-trimethoxy)phenylcumarin | CHEMBL1783716
Type:
Small organic molecule
Emp. Form.:
C19H18O5
Mol. Mass.:
326.3432
SMILES:
COc1cc(cc(OC)c1OC)-c1cc2cc(C)ccc2oc1=O
: