Target
Carbonic anhydrase 1
Ligand
BDBM35734
Substrate
Meas. Tech.
ChEMBL_750104 (CHEMBL1787521)
Ki
75±n/a nM
Citation
 Güzel, OInnocenti, AScozzafava, ASalman, ASupuran, CT Carbonic anhydrase inhibitors. Phenacetyl-, pyridylacetyl- and thienylacetyl-substituted aromatic sulfonamides act as potent and selective isoform VII inhibitors. Bioorg Med Chem Lett 19:3170-3 (2009)  
Target
Name:
Carbonic anhydrase 1
Synonyms:
CA-I CAB Carbonate dehydratase I Carbonic anhydrase 1 (CA I) Carbonic anhydrase 1 (Recombinant CA I) Carbonic anhydrase B Carbonic anhydrase I (CA I) Carbonic anhydrase I (CAI) Carbonic anhydrase isoenzyme I (hCA I) | hCA
Type:
Enzyme
Mol. Mass.:
28873.37
Organism:
Homo sapiens (Human)
Description:
P00915
Residue:
261
  
Inhibitor
Name:
BDBM35734
Synonyms:
sulfonamide deriv., 7b
Type:
Small organic molecule
Emp. Form.:
C15H16N2O3S
Mol. Mass.:
304.364
SMILES:
NS(=O)(=O)c1ccc(CNC(=O)Cc2ccccc2)cc1
: