Target
Sigma non-opioid intracellular receptor 1
Ligand
BDBM50346385
Substrate
Meas. Tech.
ChEMBL_750421 (CHEMBL1785973)
Ki
449±n/a nM
Citation
 Utech, TKöhler, JWünsch, B Synthesis of 4-(aminoalkyl) substituted 1,3-dioxanes as potent NMDA ands receptor antagonists. Eur J Med Chem 46:2157-69 (2011)  
Target
Name:
Sigma non-opioid intracellular receptor 1
Synonyms:
OPRS1 SIGMAR1 Sigma non-opioid intracellular receptor 1 Sigma1-receptor Sterol isomerase-like protein
Type:
Protein
Mol. Mass.:
25307.17
Organism:
Cavia porcellus (Guinea pig)
Description:
Q60492
Residue:
223
  
Inhibitor
Name:
BDBM50346385
Synonyms:
CHEMBL1783448 | cis-rac-N-Methyl-2-(2-phenyl-1,3-dioxan-4-yl)ethan-1-amine
Type:
Small organic molecule
Emp. Form.:
C13H19NO2
Mol. Mass.:
221.2955
SMILES:
CNCC[C@@H]1CCO[C@@H](O1)c1ccccc1
: