Target
Sigma non-opioid intracellular receptor 1
Ligand
BDBM50346388
Substrate
Meas. Tech.
ChEMBL_750421 (CHEMBL1785973)
Ki
660±n/a nM
Citation
 Utech, TKöhler, JWünsch, B Synthesis of 4-(aminoalkyl) substituted 1,3-dioxanes as potent NMDA ands receptor antagonists. Eur J Med Chem 46:2157-69 (2011)  
Target
Name:
Sigma non-opioid intracellular receptor 1
Synonyms:
OPRS1 SIGMAR1 Sigma non-opioid intracellular receptor 1 Sigma1-receptor Sterol isomerase-like protein
Type:
Protein
Mol. Mass.:
25307.17
Organism:
Cavia porcellus (Guinea pig)
Description:
Q60492
Residue:
223
  
Inhibitor
Name:
BDBM50346388
Synonyms:
(R)-2-(2,2-diphenyl-1,3-dioxan-4-yl)-N,N-dimethylethanamine | CHEMBL1783453
Type:
Small organic molecule
Emp. Form.:
C20H25NO2
Mol. Mass.:
311.418
SMILES:
CN(C)CC[C@@H]1CCOC(O1)(c1ccccc1)c1ccccc1
: