Target
Sigma non-opioid intracellular receptor 1
Ligand
BDBM50346394
Substrate
Meas. Tech.
ChEMBL_750421 (CHEMBL1785973)
Ki
1250±n/a nM
Citation
 Utech, TKöhler, JWünsch, B Synthesis of 4-(aminoalkyl) substituted 1,3-dioxanes as potent NMDA ands receptor antagonists. Eur J Med Chem 46:2157-69 (2011)  
Target
Name:
Sigma non-opioid intracellular receptor 1
Synonyms:
OPRS1 SIGMAR1 Sigma non-opioid intracellular receptor 1 Sigma1-receptor Sterol isomerase-like protein
Type:
Protein
Mol. Mass.:
25307.17
Organism:
Cavia porcellus (Guinea pig)
Description:
Q60492
Residue:
223
  
Inhibitor
Name:
BDBM50346394
Synonyms:
CHEMBL1783459
Type:
Small organic molecule
Emp. Form.:
C15H25NO2
Mol. Mass.:
251.3645
SMILES:
NCC[C@@H]1CCOC2(O1)C1CC3CC(C1)CC2C3
: