Target
Acetylcholinesterase
Ligand
BDBM50346444
Substrate
Meas. Tech.
ChEMBL_751132 (CHEMBL1787069)
IC50
9±n/a nM
Citation
 Tasso, BCatto, MNicolotti, ONovelli, FTonelli, MGiangreco, IPisani, LSparatore, ABoido, VCarotti, ASparatore, F Quinolizidinyl derivatives of bi- and tricyclic systems as potent inhibitors of acetyl- and butyrylcholinesterase with potential in Alzheimer's disease. Eur J Med Chem 46:2170-84 (2011)  
Target
Name:
Acetylcholinesterase
Synonyms:
ACES_HUMAN Acetylcholinesterase (AChE) | Acetylcholinesterase (human AChE)
Type:
Enzyme
Mol. Mass.:
67792.70
Organism:
Homo sapiens (Human)
Description:
P22303
Residue:
614
  
Inhibitor
Name:
BDBM50346444
Synonyms:
CHEMBL1782707 | [4-(4-morpholinyl)butyl]carbamic acid-3-(1,1-dimethyl-2-dimethylaminoethyl)phenylester
Type:
Small organic molecule
Emp. Form.:
C21H35N3O3
Mol. Mass.:
377.5209
SMILES:
CN(C)CC(C)(C)c1cccc(OC(=O)NCCCCN2CCOCC2)c1
: