Target
Peroxisome proliferator-activated receptor gamma
Ligand
BDBM50127933
Substrate
Meas. Tech.
ChEMBL_750879 (CHEMBL1786324)
IC50
735±n/a nM
Citation
 Al-Najjar, BOWahab, HATengku Muhammad, TSShu-Chien, ACAhmad Noruddin, NATaha, MO Discovery of new nanomolar peroxisome proliferator-activated receptor κ activators via elaborate ligand-based modeling. Eur J Med Chem 46:2513-29 (2011)  
Target
Name:
Peroxisome proliferator-activated receptor gamma
Synonyms:
NR1C3 PPAR-gamma PPARG_HUMAN Peroxisome proliferator-activated receptor gamma (PPAR gamma) Peroxisome proliferator-activated receptor gamma (PPARĪ³) peroxisome proliferator-activated receptor gamma isoform 2
Type:
Nuclear Receptor
Mol. Mass.:
57613.46
Organism:
Homo sapiens (Human)
Description:
P37231
Residue:
505
  
Inhibitor
Name:
BDBM50127933
Synonyms:
5-(4-(3-(4-(4-fluorophenoxy)-2-propylphenoxy)propoxy)phenyl)thiazolidine-2,4-dione CHEMBL1783044 | CHEMBL300026
Type:
Small organic molecule
Emp. Form.:
C27H26FNO5S
Mol. Mass.:
495.562
SMILES:
CCCc1cc(Oc2ccc(F)cc2)ccc1OCCCOc1ccc(cc1)-c1sc(=O)[nH]c1O
: