Target
Lactoylglutathione lyase
Ligand
BDBM50027952
Substrate
Meas. Tech.
ChEMBL_754309 (CHEMBL1799085)
Ki
335300±n/a nM
Citation
 Liu, MYuan, MLi, ZCheng, YKLuo, HBHu, X Structural investigation into the inhibitory mechanisms of indomethacin and its analogues towards human glyoxalase I. Bioorg Med Chem Lett 21:4243-7 (2011)  
Target
Name:
Lactoylglutathione lyase
Synonyms:
Aldoketomutase Glx I Glyoxalase I LGUL_HUMAN S-D-lactoylglutathione methylglyoxal lyase
Type:
Enzyme
Mol. Mass.:
20772.95
Organism:
Homo sapiens (Human)
Description:
Q04760
Residue:
184
  
Inhibitor
Name:
BDBM50027952
Synonyms:
5-(4-chlorobenzoyl)-1,4-dimethyl-1H-pyrrole-2-acetic acid Zomepirac | [5-(4-chlorobenzoyl)-1,4-dimethyl-1H-pyrrol-2-yl]acetic acid
Type:
Small organic molecule
Emp. Form.:
C15H14ClNO3
Mol. Mass.:
291.73
SMILES:
Cc1cc(CC(O)=O)n(C)c1C(=O)c1ccc(Cl)cc1
: