Target
Tyrosine-protein phosphatase non-receptor type 1
Ligand
BDBM50347331
Substrate
Meas. Tech.
ChEMBL_754327 (CHEMBL1799103)
IC50
16360±n/a nM
Citation
 Xie, JTian, JSu, LHuang, MZhu, XYe, FWan, Y Pyrrolo[2,3-c]azepine derivatives: a new class of potent protein tyrosine phosphatase 1B inhibitors. Bioorg Med Chem Lett 21:4306-9 (2011)  
Target
Name:
Tyrosine-protein phosphatase non-receptor type 1
Synonyms:
PTN1_HUMAN PTPN1 Protein tyrosine phosphatase-1B (PTP1B) Protein-tyrosine phosphatase 1B (PTP1B) Tyrosine-protein phosphatase non-receptor type 1 (PTP1B)
Type:
Protein phosphatase
Mol. Mass.:
49963.76
Organism:
Homo sapiens (Human)
Description:
Human recombinant GST-fusion PTP1B (1-435).
Residue:
435
  
Inhibitor
Name:
BDBM50347331
Synonyms:
CHEMBL1796989
Type:
Small organic molecule
Emp. Form.:
C25H26N2O3
Mol. Mass.:
402.4855
SMILES:
CCCCOc1ccc(cc1)-c1ccc(Cn2ccc3c2C(=O)NCCC3=O)cc1
: