Target
Cannabinoid receptor 1
Ligand
BDBM50348139
Substrate
Meas. Tech.
ChEMBL_757147 (CHEMBL1803287)
Ki
2000±n/a nM
Citation
 Martín-Couce, LMartín-Fontecha, MCapolicchio, SLópez-Rodríguez, MLOrtega-Gutiérrez, S Development of endocannabinoid-based chemical probes for the study of cannabinoid receptors. J Med Chem 54:5265-9 (2011)  
Target
Name:
Cannabinoid receptor 1
Synonyms:
CANN6 CB-R CNR CNR1_HUMAN Cannabinoid receptor Cannabinoid receptor 1 (brain)
Type:
G Protein-Coupled Receptor (GPCR)
Mol. Mass.:
52868.96
Organism:
Homo sapiens (Human)
Description:
P21554
Residue:
472
  
Inhibitor
Name:
BDBM50348139
Synonyms:
CHEMBL1800729
Type:
Small organic molecule
Emp. Form.:
C45H58N2O5
Mol. Mass.:
706.9524
SMILES:
CCCCC\C=C/C\C=C/C\C=C/C\C=C/CCCC(=O)N[C@H](C)COC(=O)[C@H](Cc1ccc(cc1)C(=O)c1ccccc1)NC(=O)CCCC#C
: