Target
Beta-2 adrenergic receptor
Ligand
BDBM50213110
Substrate
Meas. Tech.
ChEMBL_755355 (CHEMBL1804511)
EC50
2.7±n/a nM
Citation
 Jozwiak, KWoo, AYTanga, MJToll, LJimenez, LKozocas, JAPlazinska, AXiao, RPWainer, IW Comparative molecular field analysis of fenoterol derivatives: A platform towards highly selective and effective beta(2)-adrenergic receptor agonists. Bioorg Med Chem 18:728-36 (2010)  
Target
Name:
Beta-2 adrenergic receptor
Synonyms:
ADRB2 ADRB2_HUMAN Beta-2 adrenoceptor | Beta-2 adrenoreceptor
Type:
Mol. Mass.:
46461.69
Organism:
Homo sapiens (Human)
Description:
P07550
Residue:
413
  
Inhibitor
Name:
BDBM50213110
Synonyms:
(R,S)-(-)-5-{1-hydroxy-2-[1-methyl-2-(1-naphthyl)ethylamino]ethyl}-1,3-benzenediol US10617654, Compound (R,S)-5 US9492405, 37
Type:
Small organic molecule
Emp. Form.:
C21H23NO3
Mol. Mass.:
337.4122
SMILES:
C[C@@H](Cc1cccc2ccccc12)NC[C@H](O)c1cc(O)cc(O)c1
: